{"text_format":"1","workbook":"xlsx","n_sheets":12,"sheets":["INTRO","GROWTH_Hypothesis","COST_Hypothesis","Financial Model ONE-OFF","Financial Model ONE-OFF double","Financial Model RECURRENT","Financial Model COMBINED","GR_FM_ONE-OFF","GR_FM_ONE-OFF DOUBLE","GR_FM_RECURR","GR_FM_COMBINED","references"],"not_rendered":{"charts":8,"images":2,"macros":0,"external_links":1,"defined_names":22,"comments":0,"pivot_tables":0},"unopened":[{"sheet":"GR_FM_ONE-OFF","index":7,"reason":"not_a_worksheet"},{"sheet":"GR_FM_ONE-OFF DOUBLE","index":8,"reason":"not_a_worksheet"},{"sheet":"GR_FM_RECURR","index":9,"reason":"not_a_worksheet"},{"sheet":"GR_FM_COMBINED","index":10,"reason":"not_a_worksheet"}],"bounds":{"document_bytes":16777216,"sheet_cells":100000,"rows_first":2000,"rows_last":500,"rows_between":2000,"halvings":0,"cell_chars":16384,"cell_head_chars":4096},"cells_cut":0,"cells_raw":0,"read":"whole","date_system":"1900"}

{"sheet":"INTRO","index":0,"n_rows":36,"n_cols":6,"rows_kept":36,"cut":false,"hidden":false,"merged":[[15,4,15,7],[2,3,3,6],[8,2,9,8],[11,2,11,8],[13,4,13,7],[14,4,14,7],[33,4,33,7],[35,4,35,7],[17,2,17,8],[19,4,19,7],[23,4,23,7],[25,4,25,7],[31,4,31,7],[27,2,27,8],[21,4,21,7],[29,4,29,7]]}
[]
[]
[null,null,null,"REVENUE MODEL TOOL"]
[]
[]
[]
[null,null,"VERSION","1.0",null,"© ACCESS4SMEs PROJECT REF. H2020-723120"]
[]
[null,null,"Disclaimer:  This excel sheet is generated for the free use for H2020 participants. The project decline any responsibility for its incorrect use or for any conclusions obtained with its use."]
[]
[]
[null,null,"INPUTS"]
[]
[null,null,"SELECT_BM",null,"This sheet will guide you through different business model options and allows you to select your revenue streams"]
[null,null,"COST_HYPOTHESIS",null,"This sheet will allow to define the main cost categories of your business model"]
{"$rows_left_out":22}
{"sheet":"GROWTH_Hypothesis","index":1,"n_rows":56,"n_cols":15,"rows_kept":56,"cut":false,"hidden":false,"merged":[]}
["Number","Business model type","Description","Product or service?","Revenue type","Main Revenue","Secondary revenue","Ownership or right?","Example","KPI 1","KPI 2","KPI3","KPI4","KPI5","Financial model"]
[1,"Razor-blade","Consumer purchases a low-margin item and then the necessary consumable as replacement with high margin (Nesspreso-Guillette)","Product","Mainly one-off","consumables high cost","Initial purchase low cost","Ownership","Nesspreso","Average consumable price","% Increase of new consumable transactions","Average initial purchase price","% Increase of new transactions",null,"FM one-off double"]
[{"$f":"A2+1","v":2},"Inverted razor-blade","Initial purchase has a high margin, but consumables are sold at low margin","Product","Mainly one-off","Initial purchase high cost","consumables low cost","Ownership","Apple Ipod & Itunes","Average initial purchase price","% Increase of new transactions","Average consumable price","% Increase of new consumable transactions",null,"FM one-off double"]
[{"$f":"A3+1","v":3},"Upselling","High percentage of buyers ultimately purchase more than they expected in extra features or finishings. (For instance, car dealers) ","Product","one-off","Transaction","Extra features","Ownership","Audi","Average transaction amount","% Increase of new transactions","Average upselling price","% increase in upsellings",null,"FM one-off double"]
[4,"High volume low margin","Marketing with low margins at large quatities","Product","one-off","Transaction",null,"Ownership","T-shirt","Average transaction amount","% Increase of new transactions",null,null,null,"1 FM one-off"]
[5,"Bundling pricing model","Sell together, as a combined product, several products and/or services.","Product/Service","one-off","Transaction","complementary features","Ownership","Mc Menu","Average transaction price","% Increase of transactions",null,null,null,"1 FM one-off"]
[6,"Pay per use","Clients are charged as the usage of the product/service.","Product/Service","Recurrent","Consumption fee",null,"Right","Iberdrola","Average consumption invoice","% increase of consumption","% Increase of new customers","% stops subscriptions",null,"1 FM Recurrent"]
[7,"Nick and dime","Price the most cost-sensitive item as low as possible and then charge for every little extra.","Service","one-off","Transaction","complementary features","Ownership/right","Ryan Air","Average transaction amount","% Increase of new transactions","Average complementary price","% increase in complementary transactions",null,"FM one-off double"]
[8,"Service-as-a product","Standardizing a predetermined set of services typically bought together and selling for a fixed price similar to a product","Service","one-off","Transaction",null,"Ownership","Consultancy","Average transaction price","% Increase of new transactions",null,null,null,"1 FM one-off"]
[9,"Franchise (royalty based) model","Sell the right to use the business model in exchange for a percentage of revenues. ","Product/Service","Recurrent","Franchise fee",null,"Right","Mc Donalds","Average fee","% Increase of new customers","% stops subscriptions",null,null,"1 FM Recurrent"]
[10,"Subscription","Clients are charged as the usage/access of the product/service a subscription fee.","Service","Recurrent","Subscription fee",null,"Right","Newspaper","Average fee","% Increase of new customers","% stops subscriptions",null,null,"1 FM Recurrent"]
[11,"Unfair advantage","Ccapacity to charge a high margin due to an unfair advantage(locations, events, dependence…)","Product/Service","one-off","Transaction",null,"ownership/right","Disneyland","Average transaction price","% Increase of new transactions",null,null,null,"1 FM one-off"]
[12,"Demand driven service","Quick adaptation of pricing of the service to the demand.","Service","one-off","Transaction",null,"Right","Airlines","Average transaction price vs demand","% Increase of new transaction ",null,null,null,"1 FM one-off"]
[13,"Premium","Offer high-end products that appeal to brand-conscious consumers","Product/Service","one-off","Transaction",null,"Ownership","Rolls Royce","Average transaction price","% Increase of new transactions",null,null,null,"1 FM one-off"]
[14,"Cheap-chic","Marketing of stylish but inexpensive items at high margins.","Product","one-off","Transaction",null,"Ownership","IKEA","Average transaction price","% Increase of new transactions",null,null,null,"1 FM one-off"]
{"$rows_left_out":42}
{"sheet":"COST_Hypothesis","index":2,"n_rows":18,"n_cols":8,"rows_kept":18,"cut":false,"hidden":false,"merged":[]}
[null,"Cost name","FM ONE OFF","FM  RECURRENT","FM ONE OFF DOUBLE 1","FM ONE OFF DOUBLE 2","FM COMBINED RECURRENT","FM COMBINED ON OFF"]
["Cost definition","Direct","% of total prize","% of total prize","% of total prize","% of total prize","% of total prize","% of total prize"]
["Cost for manufacturing a product, including personnel, raw material, equipment… or outsourced","Manufacturing cost",0.15,0,0.35,0.1,0,0.1]
["Cost for assembly the different parts of the product if the product is not assembly from manufacturing","Assembly cost",0.05,0,0.05,0.05,0.05,0.1]
["Cost for the packaging of the product for its safe and easy delivery","Packaging cost",0.01,0,0.01,0.01,0.01,0.2]
["Cost for stocks","Warehouse cost",0.03,0,0.03,0.03,0.03,0]
["Cost for putting the product within the client premises-delivery the service to the client","Delivery cost",0.01,0.15,0.01,0.01,0.2,0.15]
["Cost and taxes due to export the product internationally","Exporting cost",0.02,0,0.02,0.02,0.02,0]
["Cost for maintence of the product, including aftersales support (including services)","Maintenance cost",0.15,0.15,0.15,0.05,0.15,0.15]
["Cost for hosting any web based element in internet (if the case)","Hosting cost",0.05,0.2,0.05,0.05,0.2,0]
["Payment fees","Payment cost",0.03,0.03,0.03,0.03,0.03,0.03]
["MARGIN",null,{"$f":"1-SUM(C3:C11)","v":0.5},{"$f":"1-SUM(D3:D11)","v":0.47},{"$f":"1-SUM(E3:E11)","v":0.29999999999999993},0.65,0.30999999999999983,0.26999999999999991]
[null,"Indirect","Cost/month","Cost/month","Cost/month","Cost/month","Cost/month","Cost/month"]
["Cost for running the company & its administration (venues, indirect personnel) (admin cost)","Running cost",10000,15000,20000,500,10000,5000]
["Cost for a direct acquisition of a client for the product (direct sales dept, events...) (marketing cost)","Acquisition cost",10000,15000,20000,500,10000,5000]
{"$rows_left_out":4}
{"sheet":"Financial Model ONE-OFF","index":3,"n_rows":66,"n_cols":38,"rows_kept":66,"cut":false,"hidden":false,"merged":[[9,26,9,37],[9,2,9,13],[8,14,8,25],[0,2,0,5],[0,6,0,9],[0,10,0,13],[9,14,9,25]]}
["Select your revenue model","KPI definition","Time evolution (year 1)",null,null,null,"Time evolution (year 2)",null,null,null,"Time evolution (year 3)"]
["Premium","KPI linked to the revenue model","Q1","Q2","Q3","Q4","Q1","Q2","Q3","Q4","Q1","Q2","Q3","Q4"]
["KPI 1",{"$f":"VLOOKUP(A$2,GROWTH_Hypothesis!B$1:O$25,9,0)","v":"Average transaction price"},70,70,70,70,80,80,80,80,100,100,100,100]
["KPI 2",{"$f":"VLOOKUP(A$2,GROWTH_Hypothesis!B$1:O$25,10,0)","v":"% Increase of new transactions"},0.2,0.3,0.4,0.3,0.2,0.3,0.4,0.3,0.2,0.3,0.4,0.3]
["KPI 3",{"$f":"VLOOKUP(A$2,GROWTH_Hypothesis!B$1:O$25,11,0)","v":0}]
["KPI 4",{"$f":"VLOOKUP(A$2,GROWTH_Hypothesis!B$1:O$25,12,0)","v":0}]
["KPI 5",{"$f":"VLOOKUP(A$2,GROWTH_Hypothesis!B$1:O$25,13,0)","v":0}]
["Starting transactions",50]
["Starting revenue",{"$f":"B8*C3","v":3500}]
[null,null,"Year 1",null,null,null,null,null,null,null,null,null,null,null,"Year 2",null,null,null,null,null,null,null,null,null,null,null,"Year 3"]
["Month N",null,1,{"$f":"C11+1","v":2},{"$f":"D11+1","v":3},4,5,6,7,8,9,10,11,12,13,14,15,16,17,18,19,20,21,22,23,24,25,26,27,28,29,30,31,32,33,34,35,36]
["REVENUE STREAM ONE-OFF"]
[]
["Revenue & customer Growth"]
[null,{"$f":"B3","v":"Average transaction price"},{"$f":"$C3","v":70},{"$f":"$C3","v":70},70,{"$f":"$D3","v":70},{"$f":"$D3","v":70},70,{"$f":"$E3","v":70},{"$f":"$E3","v":70},70,{"$f":"$F3","v":70},{"$f":"$F3","v":70},70,{"$f":"$G3","v":80},{"$f":"$G3","v":80},{"$f":"$G3","v":80},{"$f":"$H3","v":80},{"$f":"$H3","v":80},{"$f":"$H3","v":80},{"$f":"$I3","v":80},{"$f":"$I3","v":80},{"$f":"$I3","v":80},{"$f":"$J3","v":80},{"$f":"$J3","v":80},{"$f":"$J3","v":80},{"$f":"$K3","v":100},{"$f":"$K3","v":100},{"$f":"$K3","v":100},{"$f":"$L3","v":100},{"$f":"$L3","v":100},{"$f":"$L3","v":100},{"$f":"$M3","v":100},{"$f":"$M3","v":100},{"$f":"$M3","v":100},{"$f":"$N3","v":100},{"$f":"$N3","v":100},{"$f":"$N3","v":100}]
{"$rows_left_out":52}
{"sheet":"Financial Model ONE-OFF double","index":4,"n_rows":103,"n_cols":38,"rows_kept":103,"cut":false,"hidden":false,"merged":[[11,26,11,37],[46,26,46,37],[10,14,10,25],[11,2,11,13],[46,2,46,13],[0,2,0,5],[0,6,0,9],[0,10,0,13],[11,14,11,25],[46,14,46,25]]}
["Select your revenue model","KPI definition","Time evolution (Year 1)",null,null,null,"Time evolution (Year 2)",null,null,null,"Time evolution (Year 3)"]
["Inverted razor-blade","KPI linked to the revenue model","Q1","Q2","Q3","Q4","Q1","Q2","Q3","Q4","Q1","Q2","Q3","Q4"]
["KPI 1",{"$f":"VLOOKUP(A$2,GROWTH_Hypothesis!B$1:O$25,9,0)","v":"Average initial purchase price"},70,80,70,100,70,80,70,100,70,80,70,100]
["KPI 2",{"$f":"VLOOKUP(A$2,GROWTH_Hypothesis!B$1:O$25,10,0)","v":"% Increase of new transactions"},0.2,0.3,0.4,0.3,0.2,0.3,0.4,0.3,0.2,0.3,0.4,0.3]
["KPI 3",{"$f":"VLOOKUP(A$2,GROWTH_Hypothesis!B$1:O$25,11,0)","v":"Average consumable price"},100,100,100,100,100,100,100,100,100,100,100,100]
["KPI 4",{"$f":"VLOOKUP(A$2,GROWTH_Hypothesis!B$1:O$25,12,0)","v":"% Increase of new consumable transactions"},0.2,0.3,0.4,0.3,0.2,0.3,0.4,0.3,0.2,0.3,0.4,0.3]
["KPI 5",{"$f":"VLOOKUP(A$2,GROWTH_Hypothesis!B$1:O$25,13,0)","v":0}]
["Starting transactions 1",50]
["Starting revenue 1",{"$f":"B8*C3","v":3500}]
["Starting transactions 2",50]
["Starting revenue 2",{"$f":"B10*C5","v":5000}]
[null,null,"Year 1",null,null,null,null,null,null,null,null,null,null,null,"Year 2",null,null,null,null,null,null,null,null,null,null,null,"Year 3"]
["Month N",null,1,{"$f":"C13+1","v":2},{"$f":"D13+1","v":3},4,5,6,7,8,9,10,11,12,13,14,15,16,17,18,19,20,21,22,23,24,25,26,27,28,29,30,31,32,33,34,35,36]
["REVENUE STREAM 1: ONE OFF"]
[]
{"$rows_left_out":89}
{"sheet":"Financial Model RECURRENT","index":5,"n_rows":65,"n_cols":38,"rows_kept":65,"cut":false,"hidden":false,"merged":[[9,26,9,37],[8,14,8,25],[9,2,9,13],[0,2,0,5],[0,6,0,9],[0,10,0,13],[9,14,9,25]]}
["Select your revenue model","KPI definition","Time evolution (Year 1)",null,null,null,"Time evolution (Year 2)",null,null,null,"Time evolution (Year 3)"]
["Subscription","KPI linked to the revenue model","Q1","Q2","Q3","Q4","Q1","Q2","Q3","Q4","Q1","Q2","Q3","Q4"]
["KPI 1",{"$f":"VLOOKUP(A$2,GROWTH_Hypothesis!B$1:O$25,9,0)","v":"Average fee"},70,70,70,70,75,75,75,75,80,80,80,80]
["KPI 2",{"$f":"VLOOKUP(A$2,GROWTH_Hypothesis!B$1:O$25,10,0)","v":"% Increase of new customers"},0.2,0.3,0.3,0.3,0.2,0.2,0.2,0.2,0.2,0.3,0.4,0.3]
["KPI 3",{"$f":"VLOOKUP(A$2,GROWTH_Hypothesis!B$1:O$25,11,0)","v":"% stops subscriptions"},0.04,0.03,0.03,0.02,0.04,0.03,0.03,0.02,0.04,0.03,0.03,0.02]
["KPI 4",{"$f":"VLOOKUP(A$2,GROWTH_Hypothesis!B$1:O$25,12,0)","v":0}]
["KPI 5",{"$f":"VLOOKUP(A$2,GROWTH_Hypothesis!B$1:O$25,13,0)","v":0}]
["Starting customers",10]
["Starting revenue",{"$f":"B8*C3","v":700}]
[null,null,"Year 1",null,null,null,null,null,null,null,null,null,null,null,"Year 2",null,null,null,null,null,null,null,null,null,null,null,"Year 3"]
["Month N",null,1,{"$f":"C11+1","v":2},{"$f":"D11+1","v":3},4,5,6,7,8,9,10,11,12,13,14,15,16,17,18,19,20,21,22,23,24,25,26,27,28,29,30,31,32,33,34,35,36]
["REVENUE STREAM RECURRENT"]
[]
["Revenue & customer Growth"]
[null,"Average revenue per new customer",{"$f":"$C3","v":70},{"$f":"$C3","v":70},70,{"$f":"$D3","v":70},{"$f":"$D3","v":70},70,{"$f":"$E3","v":70},{"$f":"$E3","v":70},{"$f":"$E3","v":70},{"$f":"$F3","v":70},{"$f":"$F3","v":70},{"$f":"$F3","v":70},{"$f":"$G3","v":75},{"$f":"$G3","v":75},{"$f":"$G3","v":75},{"$f":"$H3","v":75},{"$f":"$H3","v":75},{"$f":"$H3","v":75},{"$f":"$I3","v":75},{"$f":"$I3","v":75},{"$f":"$I3","v":75},{"$f":"$J3","v":75},{"$f":"$J3","v":75},{"$f":"$J3","v":75},{"$f":"$K3","v":80},{"$f":"$K3","v":80},{"$f":"$K3","v":80},{"$f":"$L3","v":80},{"$f":"$L3","v":80},{"$f":"$L3","v":80},{"$f":"$M3","v":80},{"$f":"$M3","v":80},{"$f":"$M3","v":80},{"$f":"$N3","v":80},{"$f":"$N3","v":80},{"$f":"$N3","v":80}]
{"$rows_left_out":51}
{"sheet":"Financial Model COMBINED","index":6,"n_rows":100,"n_cols":38,"rows_kept":100,"cut":false,"hidden":false,"merged":[[11,26,11,37],[10,14,10,25],[11,2,11,13],[0,2,0,5],[0,6,0,9],[0,10,0,13],[11,14,11,25]]}
["Select your revenue model","KPI definition","Time evolution (Year 1)",null,null,null,"Time evolution (Year 2)",null,null,null,"Time evolution (Year 3)"]
["Free combination","KPI linked to the revenue model","Q1","Q2","Q3","Q4","Q1","Q2","Q3","Q4","Q1","Q2","Q3","Q4"]
["KPI 1",{"$f":"VLOOKUP(A$2,GROWTH_Hypothesis!B$1:O$26,9,0)","v":"Average fee"},70,80,70,100,70,80,70,100,70,80,70,100]
["KPI 2",{"$f":"VLOOKUP(A$2,GROWTH_Hypothesis!B$1:O$26,10,0)","v":"% Increase of new customers"},0.2,0.3,0.4,0.3,0.2,0.3,0.4,0.3,0.2,0.3,0.4,0.3]
["KPI 3",{"$f":"VLOOKUP(A$2,GROWTH_Hypothesis!B$1:O$26,11,0)","v":"% stops subscriptions"},0.04,0.03,0.03,0.02,0.04,0.03,0.03,0.02,0.04,0.03,0.03,0.02]
["KPI 4",{"$f":"VLOOKUP(A$2,GROWTH_Hypothesis!B$1:O$26,12,0)","v":"Average transaction price"},70,80,70,100,70,80,70,100,70,80,70,100]
["KPI 5",{"$f":"VLOOKUP(A$2,GROWTH_Hypothesis!B$1:O$26,13,0)","v":"% Increase of new transactions"},0.2,0.3,0.4,0.3,0.2,0.3,0.4,0.3,0.2,0.3,0.4,0.3]
["Starting customers",50]
["Starting revenue",{"$f":"B8*C3","v":3500}]
["Starting transactions 2",50]
["Starting revenue 2",{"$f":"B10*C6","v":3500}]
[null,null,"Year 1",null,null,null,null,null,null,null,null,null,null,null,"Year 2",null,null,null,null,null,null,null,null,null,null,null,"Year 3"]
[null,null,1,{"$f":"C13+1","v":2},{"$f":"D13+1","v":3},4,5,6,7,8,9,10,11,12,13,14,15,16,17,18,19,20,21,22,23,24,25,26,27,28,29,30,31,32,33,34,35,36]
["REVENUE STREAM 1: RECURRING"]
[]
{"$rows_left_out":86}
{"sheet":"references","index":11,"n_rows":7,"n_cols":1,"rows_kept":7,"cut":false,"hidden":false,"merged":[]}
["References"]
["The board of innovation: find new revenue models to your idea B2B-B2C"]
["Seizing the white space by Mark Johnson"]
["SaaS Business model. On the cloud, the customer is king (Joel York)"]
["Gary Gaspar (www.marker.io) Early stage SaaS financial plan"]
["https://www.entrepreneurs-journey.com/8127/what-is-b2b/"]
["50 business models you should copy today: Board of innovation"]